Home > Error Code > Installer Failed With Return Code -1073741819

Installer Failed With Return Code -1073741819

Contents

However, after I read a workaround about disabling anti-virus software, I tried it on my Dr.Web and had a success in installing extension pack. Action start 20:23:41: WiseNextDlg. It really depends on what you find in it though.Jason | http://blog.configmgrftw.com Marked as answer by Phil Balderos Thursday, September 19, 2013 11:27 AM Tuesday, September 17, 2013 8:54 PM Reply ERROR_INSTALL_PACKAGE_VERSION1613This installation package cannot be installed by the Windows Installer service. http://clockworklaw.com/error-code/installation-failed-with-windows-installer-error-1619.php

Available beginning with Windows Installer version 4.5. Not this time. In addition to that the MCS server being accessed will also be listed, e.g.:'https://mcs-amzn-eu-west-1-9af7.upe.p.hmr.sophos.com/sophos/management/ep', for the above example, can the Sophos certificate be obtained from this URL. To ensure that the Windows Installer Service is properly installed and configured, it is recommended that users install the file InstmsiA.exe on Windows 95/98/Me or InstmsiW.exe on Win NT systems.

Msi Error Codes

Details I use: Microsoft Windows XP Home Edition, Service Pack 3 (SP3) VirtualBox 4.0.4r70112 Norton Security Suite 3.8.0.41. First I would try is manually extracting the files myself and capturing them from the temp directory when the exe runs just to see what's all in there and potentially directly Note the values listed for TEMP and TMP, and delete all files in those locations. Doesn't help.

Since those applications will not install if IE and Office applications are running. LinkedIn and other Discussions I had also posted this on LinkedIn Discussions and have got some quality responses for the same - I will extract some information from there and post The MSI log for MCS should prove helpful at understanding the underlying cause, for example, the product has been removed without using the installer. 125 Cause The installer has found registry Exit Code 1603 Sccm Board index The team • Delete all board cookies • All times are UTC + 1 hour [ DST ] Get VirtualBox Forum powered by phpBB © phpBB Group By any

Contact your support personnel to verify that the Windows Installer service is properly registered. Msi Error Code 1603 Available beginning with Windows Installer version 3.0. Multiple-Package Installations cannot run if rollback is disabled. Error Message: The installer failed with exit code 1: VBoxExtPackHelperApp.exe: error: Failed to rename the temporary directory to the final one: VERR_ACCESS_DENIED ('C:\PROGRA~1\ Oracle\VIRTUA~1\ExtensionPacks\Oracle_VM_VirtualBox_Extension_Pack-_-inst-5752' ->'C:\PROGRA~1\Oracle\VIRTUA~1\ExtensionPacks\Oracle_VM_VirtualBox_Extension_Pack') Result Code: E_FAIL (0x80004005) Component: ExtPackManager

Thank you Regards!! Mainenginethread Is Returning 1603 The return code for an installation can be found at the end of the 'Sophos Endpoint Bootstrap_[Timestamp].txt' log, typically in the user's temp location, i.e. %temp%. Verify that the source exists and that you can access it. All rights reserved.Newsletter|Contact Us|Privacy Statement|Terms of Use|Trademarks|Site Feedback {{offlineMessage}} Try Microsoft Edge, a fast and secure browser that's designed for Windows 10 Get started Store Store home Devices Microsoft Surface PCs

  • What To Do See article119619 for guidance. 120 Cause The Sophos Central installer has failed to install Sophos AutoUpdate.
  • Perhaps you can have a look on the following lines from my verbose.log: [quote] Action 20:23:41: WiseNextDlg.
  • and nothing.
  • Important: It is strongly recommended you check article 120448first as it is the most common occurrence for installation failure.

Msi Error Code 1603

I use: Microsoft Windows 7 Professional VirtualBox 4.0.4r70112 Dr.Web 6.0.5.02020 I also thought about UAC when encountered this error while trying to install extension pack, and also disabling UAC didn't help. If it is a capture msi (original source is non-msi) I would systematically exclude files and registry keys until I isolated the component causing the issue in my msi. Msi Error Codes This indicates that short file name creation is enabled. Psexec Error Code 1619 ERROR_CALL_NOT_IMPLEMENTED120This value is returned when a custom action attempts to call a function that cannot be called from custom actions.

The installer failed with exit code 1: VBoxExtPackHelperApp.exe: error: Failed to rename the temporary directory to the final one: VERR_ACCESS_DENIED ('C:\Program Files\Oracle\VirtualBox/ExtensionPacks/Oracle_VM_VirtualBox_Extension_Pack-_-inst-5688' -> 'C:\Program Files\Oracle\VirtualBox/ExtensionPacks/Oracle_VM_VirtualBox_Extension_Pack') rcExit=1. http://clockworklaw.com/error-code/installer-error-code-2753.php Good luck. As a result Sophos AutoUpdate does not have any credentials and therefore cannot download Sophos Anti-Virus. See More 1 2 3 4 5 Overall Rating: 0 (0 ratings) Log in or register to post comments ActionsThis Discussion 1 Votes Follow Shortcut Abuse PDF Related Content Show - Windows Installer Error Codes

Tested so far: safe mode, disabling antivirus, deliberately disabling UAC, cleaning up extpacks and installing through elevated CMD... I could not test last night as I was busy with good ok patch Tuesday. Thanks for your help!Phil Balderos Wednesday, September 18, 2013 1:03 PM Reply | Quote 0 Sign in to vote That looks really strange, more like your extractor opened an MSI. http://clockworklaw.com/error-code/installation-failed-with-error-code-0x800c0005.php Step 1: Generate a verbose log file named msi*.log in the %temp% directory the next time the setup package is executed. (Click here to know more ways to generate log).

Have admin in rights to do it. Msi Error 1619 Windows 7 Evidence of the policy being received would be updating credentials being populated in the Sophos AutoUpdate configure dialog. Can you grab the extracted files from %temp%?

I installed VirtualBox 4.0.0 onto Windows 7 Professional and attempted to install the extension pack: Oracle_VM_VirtualBox_Extension_Pack-4.0.0-69151.vbox-extpack The attempt failed with: The installer failed with exit code 1: VBoxExtPackHelperApp.exe: error: Failed to

What happens if you manually run the setup? Close all running applications and utilities, and launch the installation again. This error code is returned if the user chooses not to try the installation. Psexec Error Code 1603 What To Do See article119726 for more information on which products need to be uninstalled. 112 Cause The Sophos Centralinstaller has been run without administrative rights.

What happens if you manually run the setup? However, I did find a solution. comment:14 in reply to: ↑ 6 Changed 22 months ago by Yotta Replying to JeffDwork: Same problem and solution (disable anti-virus software) Microsoft Windows XP SP3 VirtualBox 4.0.4r70112 (also 4.0.2r69518) Norton Security this contact form I then decided to try installing from Safe Mode -- that worked fine (Note: I do not know if it is significant but I still had UAC turned "off" when I

You can use procmon to see what's going on and they may help. ERROR_INSTALL_TRANSFORM_REJECTED1644One or more customizations are not permitted by system policy. Cheers' Viju Microsoft MVP [Setup-Deploy] Weblog: www.msigeek.com 0 Login to vote ActionsLogin or register to post comments R-Vijay Understanding Error 1603: Fatal Error During Installation - Comment:05 Dec 2007 : Link Here it is: After 2 days, I finally made Skype and Facebook VideoCall both work on my Windows8 Dell computer.

In each case the results were exactly the same. The installer failed with exit code 1: VBoxExtPackHelperApp.exe: error: Failed to rename the temporary directory to the final one: VERR_ACCESS_DENIED ('C:\Program Files\Oracle\VirtualBox\ExtensionPacks\Oracle_VM_VirtualBox_Extension_Pack-_-inst-12708' -> 'C:\Program Files\Oracle\VirtualBox\ExtensionPacks\Oracle_VM_VirtualBox_Extension_Pack') rcExit=1. If it doesn't fall in this last, it could be any other error which occurred during the installation, do update in the comments..lets fix that..! Troubleshooting 1603 MSI Error As discussed, The 1603 error code is mostly returned when any action fails during an installation on Windows, and most commonly it indicates that one of the

comment:5 in reply to: ↑ 4 Changed 6 years ago by elfsoft Replying to cccv: Replying to lnoland: I figured out a workaround for my problem. ... Failing which please supply this log to Sophos Technical Support. p.s.