Home > Error Code > Installation Error 1624

Installation Error 1624

Contents

All rights reserved.Newsletter|Contact Us|Privacy Statement|Terms of Use|Trademarks|Site Feedback Developer resources Microsoft developer Windows Windows Dev Center Windows apps Desktop Internet of Things Games Holographic Microsoft Edge Hardware Azure Azure Web apps Resolution Following you will find possible solutions to the two causes above: Check whether the supplied path is correct and the variables, if used, are resolved correctly.Furthermore check the credentials used ERROR_INSTALL_SERVICE_FAILURE1601The Windows Installer service could not be accessed. For example, the existance of HKCR\Installer\Products\hash corresponding key 1606 ERROR_UNKNOWN_FEATURE Feature ID not registered. 1607 ERROR_UNKNOWN_COMPONENT Component ID not registered. 1608 ERROR_UNKNOWN_PROPERTY Unknown property. 1609 ERROR_INVALID_HANDLE_STATE Handle is in an invalid have a peek here

ERROR_INSTALL_PLATFORM_UNSUPPORTED1633This installation package is not supported on this platform. Available beginning with Windows Installer version 3.0. ERROR_UNKNOWN_PRODUCT1605This action is only valid for products that are currently installed. Consult the Windows Installer SDK for detailed command line help. 1640 ERROR_INSTALL_REMOTE_DISALLOWED Installation from a Terminal Server client session not permitted for current user. 1641 ERROR_SUCCESS_REBOOT_INITIATED The installer has started a

Msi Error Codes

Verify that the specified transform paths are valid. 0 Comments [ + ] Show Comments Comments Please log in to comment Rating comments in this legacy AppDeploy message board thread ERROR_INSTALL_TEMP_UNWRITABLE1632The Temp folder is either full or inaccessible. Incoming Links Re: Installing Acrobat XI with Application Manager gave error 1624 Legend Correct Answers - 10 points © 2016 Adobe Systems Incorporated.

  1. Re: Update Error: 1624 Ankit_Jain Oct 13, 2010 12:32 AM (in response to DNesko48) Can you please try the CS Cleaner Script from:http://www.adobe.com/support/contact/cs5clean.htmlThis should help you resolve your problem.ThanksAnkit Like Show
  2. All rights reserved.
  3. More info here 1621 ERROR_INSTALL_UI_FAILURE There was an error starting the Windows Installer service user interface.
  4. ERROR_INSTALL_TRANSFORM_FAILURE1624There was an error applying transforms.

This documentation is archived and is not being maintained. We appreciate your feedback. Solution: Check if the product is installed first. Windows Installer Error 1619 Verify that the temp folder exists and that you can write to it. 1633 ERROR_INSTALL_PLATFORM_UNSUPPORTED This installation package is not supported on this platform.

C:\CAE1.5 (don't download into your profile / onto your desktop, or a network share).#4 - Re-run the installation.Regards,Ken 1334-87413-580337 Back to top Laticia Bomar Members #5 Laticia Bomar 3 posts Posted Msi Error Code 1603 ERROR_PATCH_PACKAGE_REJECTED1643The patch package is not permitted by system policy. It means something is wrong with the package. 1604 ERROR_INSTALL_SUSPEND Installation suspended, incomplete. 1605 ERROR_UNKNOWN_PRODUCT This action is only valid for products that are currently installed. Contact your support personnel.

Cooke Thursday, November 11, 2010 4:20 AM Reply | Quote Answers 0 Sign in to vote Hi, Installer Error 1624 means There was an error applying transforms. Msi Motherboard Error Codes More info here. 1620 ERROR_INSTALL_PACKAGE_INVALID This installation package could not be opened. In bold, you`ll find the ones you'll encounter the most. ERROR_INSTALL_USEREXIT1602The user cancels installation.

Msi Error Code 1603

acrobat is part of the the CS4 master collection on my computer. Value returned Error code Error description Solution 0 ERROR_SUCCESS Action completed successfully. Msi Error Codes ERROR_PATCH_PACKAGE_OPEN_FAILED1635This patch package could not be opened. Windows Installer Error Codes More Information MicrosoftOfficeResource Kit (ORK):http://www.microsoft.com/en-us/download/details.aspx?id=5981 Keywords MSI, error, 1624, corrupt, ORK, Office, Resource Kit Products C6, C7
Related Articles HOW TO: Pass parameters to the MSI script command HOW TO:

Verify that the Temp folder exists and that you can write to it. http://clockworklaw.com/error-code/installation-error-code-1639-fix-it.php For example if both 9.3.3 and 9.3.4 patches have been downloaded, install the 9.3.3 patch first followed by the 9.3.4 patch. ERROR_INSTALL_PACKAGE_VERSION1613This installation package cannot be installed by the Windows Installer service. Environment Windows Resolving the problem The simplest work-around is to copy all the .MST file to the directory in the error message. There Was An Error Applying Transforms. Verify That The Specified Transform Paths Are Valid.

ERROR_INVALID_HANDLE_STATE1609The handle is in an invalid state. Nothing found on the internet that addresses how to resolve this issue.Stephen B. Error codes for Windows Installer May 6, 2013 by admin 0 We're presenting below a list of exit codes that msiexec.exe returns and, in some cases, what to do to fix Check This Out I have the same question Show 0 Likes(0) 6983Views Tags: none (add) This content has been marked as final.

Verify that the the specified transform paths are valid.' Symptom Install of DB2 fails with 'Error applying transforms. Windows Installer Returned 1613 Vmware Watson Product Search Search None of the above, continue with my search Install of DB2 fails with 'Error applying transforms.' setup; 1033.mst; error 1624 Technote (troubleshooting) Problem(Abstract) Install of DB2 fails ERROR_UNKNOWN_FEATURE1606The feature identifier is not registered.

Consult the Windows Installer SDK for detailed command-line help.

Toggle navigation Software Tips Questions Blogs Links Communities Questions & Answers Help with MSI 1624 Help with MSI 1624 AppDeploy.com How helpful is this to you? ERROR_UNKNOWN_PROPERTY1608This is an unknown property. Available beginning with Windows Installer version 3.0. Windows Installer Returned 1639 Answered 02/18/2007 by: williamp Please log in to comment Please log in to comment Answer this question or Comment on this question for clarity AnswerSubmit Don't be a Stranger!

ERROR_INVALID_DATA13The data is invalid. For example, the DB2 Installation image is located in D:\db2_install\SERVER\image then copy the transform files ( *.mst ) D:\db2_install\SERVER\image\db2\Windows\SERVER\*.mst to C:\INSTAL~1\EXP\image\db2\Windows\SERVER Delete the copied files after DB2 is successfully installed. You must install a Windows service pack that contains a newer version of the Windows Installer service. this contact form If the directory no longer exists and unsure what the full directory name was, INSTAL~1 for example, then just create the directory with '~1' in the directory name.

Installation of MSI File failed with code 1624 Started by Laticia Bomar , 16 March 2007 - 09:53 PM Login to Reply 4 replies to this topic Laticia Bomar Members #1 Tagged 1624, ERROR_INSTALL_TRANSFORM_FAILURE, exit code 1624, fix error 1624, msi error 1624, msiexec, return value 1624, windows installer. To configure or remove the existing version of this product, use Add/Remove Programs in Control Panel. To use Knowledgebase Manager Pro, enable JavaScript by changing your browser options, then try again.

Contact your support personnel. ERROR_INSTALL_TRANSFORM_REJECTED1644One or more customizations are not permitted by system policy. To configure or remove the existing version of this product, use Add/Remove Programs in Control Panel. 1639 ERROR_INVALID_COMMAND_LINE Invalid command line argument. ERROR_INSTALL_SOURCE_ABSENT1612The installation source for this product is not available.

Contact your support personnel. Like Show 0 Likes(0) Actions 8. ERROR_UNKNOWN_PATCH1647The patch is not applied to this product. Available beginning with Windows Installer version 4.5.

Contact your support personnel. 1611 ERROR_INDEX_ABSENT Component qualifier not present. 1612 ERROR_INSTALL_SOURCE_ABSENT The installation source for this product is not available.